Target
Glutamate receptor ionotropic, kainate 1
Ligand
BDBM141506
Substrate
Meas. Tech.
Radioligand Binding Assay
Ki
35.0±n/a nM
Citation
 Li, GZhou, HWeiss, JDoller, DBurns, JF Bicyclo[3.2.1]octyl amide derivatives and uses of same US Patent  US9656975 Publication Date 5/23/2017 
Target
Name:
Glutamate receptor ionotropic, kainate 1
Synonyms:
GLUR5 GRIK1_HUMAN Glutamate kainate Glutamate receptor ionotropic kainate 1 Glutamate-Kainate Grik1 protein | hmglur5 flipr
Type:
Enzyme Catalytic Domain
Mol. Mass.:
103984.96
Organism:
Homo sapiens (Human)
Description:
P39086
Residue:
918
  
Inhibitor
Name:
BDBM141506
Synonyms:
US8921370, 160 | US9656975, 160
Type:
Small organic molecule
Emp. Form.:
C21H23FN4O2
Mol. Mass.:
382.4313
SMILES:
Cc1cncc(n1)C(=O)N[C@]12CC[C@](C1)(CCC2)NC(=O)c1cccc(F)c1
: