Target
Glutamate receptor ionotropic, kainate 1
Ligand
BDBM141509
Substrate
Meas. Tech.
Radioligand Binding Assay
Ki
500±n/a nM
Citation
 Li, GZhou, HWeiss, JDoller, DBurns, JF Bicyclo[3.2.1]octyl amide derivatives and uses of same US Patent  US9656975 Publication Date 5/23/2017 
Target
Name:
Glutamate receptor ionotropic, kainate 1
Synonyms:
GLUR5 GRIK1_HUMAN Glutamate kainate Glutamate receptor ionotropic kainate 1 Glutamate-Kainate Grik1 protein | hmglur5 flipr
Type:
Enzyme Catalytic Domain
Mol. Mass.:
103984.96
Organism:
Homo sapiens (Human)
Description:
P39086
Residue:
918
  
Inhibitor
Name:
BDBM141509
Synonyms:
US8921370, 176 | US9656975, 176
Type:
Small organic molecule
Emp. Form.:
C22H24ClN3O2
Mol. Mass.:
397.898
SMILES:
Cc1cccc(NC(=O)C23CCC(C2)(CCC3)NC(=O)c2cccc(Cl)c2)n1
: