Target
Tyrosine-protein kinase BTK
Ligand
BDBM309679
Substrate
Meas. Tech.
Btk In Vitro Inhibitory Assay
IC50
<10±n/a nM
Citation
 Chen, WJia, ZJThomas, WD Inhibitors of Bruton's tyrosine kinase US Patent  US9656988 Publication Date 5/23/2017 
Target
Name:
Tyrosine-protein kinase BTK
Synonyms:
AGMX1 Agammaglobulinaemia tyrosine kinase B cell progenitor kinase BPK BTK_HUMAN Tyrosine Kinase BTK Tyrosine-protein kinase BTK (BTK)
Type:
Enzyme
Mol. Mass.:
76289.95
Organism:
Homo sapiens (Human)
Description:
Q06187
Residue:
659
  
Inhibitor
Name:
BDBM309679
Synonyms:
(R)-3-(4-(1-formylpiperidin-4-yl)phenylamino)-5-(3-(piperidine-1-carboxamido)piperidin-1-yl)pyrazine-2-carboxamide | US9656988, Example 148
Type:
Small organic molecule
Emp. Form.:
C28H38N8O3
Mol. Mass.:
534.6531
SMILES:
NC(=O)c1ncc(nc1Nc1ccc(cc1)C1CCN(CC1)C=O)N1CCC[C@H](C1)NC(=O)N1CCCCC1
: