Target
Tyrosine-protein kinase BTK
Ligand
BDBM309880
Substrate
Meas. Tech.
Btk In Vitro Inhibitory Assay
IC50
<10±n/a nM
Citation
 Chen, WJia, ZJThomas, WD Inhibitors of Bruton's tyrosine kinase US Patent  US9656988 Publication Date 5/23/2017 
Target
Name:
Tyrosine-protein kinase BTK
Synonyms:
AGMX1 Agammaglobulinaemia tyrosine kinase B cell progenitor kinase BPK BTK_HUMAN Tyrosine Kinase BTK Tyrosine-protein kinase BTK (BTK)
Type:
Enzyme
Mol. Mass.:
76289.95
Organism:
Homo sapiens (Human)
Description:
Q06187
Residue:
659
  
Inhibitor
Name:
BDBM309880
Synonyms:
(R)-3-(4-(1-cyclopentylpiperidin-4-yl)phenylamino)-5-(3-(cyclopropanecarboxamido)-2-methylpiperidin-1-yl)pyrazine-2-carboxamide | US9656988, Example 349
Type:
Small organic molecule
Emp. Form.:
C31H43N7O2
Mol. Mass.:
545.7188
SMILES:
CC1[C@@H](CCCN1c1cnc(C(N)=O)c(Nc2ccc(cc2)C2CCN(CC2)C2CCCC2)n1)NC(=O)C1CC1
: