Target
Nuclear receptor ROR-gamma [238-497]
Ligand
BDBM175820
Substrate
Meas. Tech.
TR-FRET Assay
pH
6.8±n/a
IC50
500±n/a nM
Comments
extracted
Citation
 Finsinger, DWucherer-Plietker, MBlume, B Substituted tetrazolo[1,5-a]pyrazines as ROR-gamma inhibitors US Patent  US9688684 Publication Date 6/27/2017 
Target
Name:
Nuclear receptor ROR-gamma [238-497]
Synonyms:
NR1F3 RORG RZRG | Retinoid-related orphan receptor gamma (RORgamma-LBD)
Type:
Protein
Mol. Mass.:
29835.99
Organism:
Homo sapiens (Human)
Description:
Human RORgamma ligand-binding domain.
Residue:
260
  
Inhibitor
Name:
BDBM175820
Synonyms:
US9688684, Compound 17: {4-[7-(3-Fluoro-benzyl)-5,6,7,8-tetrahydro-tetrazolo[1,5-a]pyrazin-8-yl]-phenyl}-dimethyl-amine
Type:
Small organic molecule
Emp. Form.:
C19H21FN6
Mol. Mass.:
352.4086
SMILES:
CN(C)c1ccc(cc1)C1N(Cc2cccc(F)c2)CCn2nnnc12
: