Target
Nuclear receptor ROR-gamma [238-497]
Ligand
BDBM175898
Substrate
Meas. Tech.
TR-FRET Assay
pH
6.8±n/a
IC50
500±n/a nM
Comments
extracted
Citation
 Finsinger, DWucherer-Plietker, MBlume, B Substituted tetrazolo[1,5-a]pyrazines as ROR-gamma inhibitors US Patent  US9688684 Publication Date 6/27/2017 
Target
Name:
Nuclear receptor ROR-gamma [238-497]
Synonyms:
NR1F3 RORG RZRG | Retinoid-related orphan receptor gamma (RORgamma-LBD)
Type:
Protein
Mol. Mass.:
29835.99
Organism:
Homo sapiens (Human)
Description:
Human RORgamma ligand-binding domain.
Residue:
260
  
Inhibitor
Name:
BDBM175898
Synonyms:
US9688684, Compound 95: 8-(2,3-Dihydro-benzo[1,4]dioxin-6-yl)-7-(3-methyl-benzyl)-5,6,7,8-tetrahydro-tetrazolo[1,5-a]pyrazine
Type:
Small organic molecule
Emp. Form.:
C20H21N5O2
Mol. Mass.:
363.413
SMILES:
Cc1cccc(CN2CCn3nnnc3C2c2ccc3OCCOc3c2)c1
: