Target
Glutaminyl-peptide cyclotransferase
Ligand
BDBM309917
Substrate
Meas. Tech.
Spectrophotometric Assay
IC50
650±n/a nM
Citation
 Buchholz, MHeiser, UNiestroj, AJSommer, R Inhibitors of glutaminyl cyclase US Patent  US9656991 Publication Date 5/23/2017 
Target
Name:
Glutaminyl-peptide cyclotransferase
Synonyms:
Glutaminyl Cyclase Glutaminyl-peptide cyclotransferase Glutaminyl-tRNA cyclotransferase QPCT | QPCT_HUMAN
Type:
Enzyme
Mol. Mass.:
40877.05
Organism:
Homo sapiens (Human)
Description:
Q16769
Residue:
361
  
Inhibitor
Name:
BDBM309917
Synonyms:
1-(3,4- dimethoxyphenyl)-3- (4-(5-methyl-1H- imidazol-1- yl)butyl)thiourea | US9656991, 31
Type:
Small organic molecule
Emp. Form.:
C17H24N4O2S
Mol. Mass.:
348.463
SMILES:
COc1ccc(NC(=S)NCCCCn2cncc2C)cc1OC
: