Target
Glutaminyl-peptide cyclotransferase
Ligand
BDBM309931
Substrate
Meas. Tech.
Spectrophotometric Assay
IC50
14000±n/a nM
Citation
 Buchholz, MHeiser, UNiestroj, AJSommer, R Inhibitors of glutaminyl cyclase US Patent  US9656991 Publication Date 5/23/2017 
Target
Name:
Glutaminyl-peptide cyclotransferase
Synonyms:
Glutaminyl Cyclase Glutaminyl-peptide cyclotransferase Glutaminyl-tRNA cyclotransferase QPCT | QPCT_HUMAN
Type:
Enzyme
Mol. Mass.:
40877.05
Organism:
Homo sapiens (Human)
Description:
Q16769
Residue:
361
  
Inhibitor
Name:
BDBM309931
Synonyms:
1-(2-(trifluoro- methoxy-)benzyl)-3- (1H-benzo[d]- imidazol-5-yl)- thiourea | US9656991, 45
Type:
Small organic molecule
Emp. Form.:
C16H13F3N4OS
Mol. Mass.:
366.361
SMILES:
FC(F)(F)Oc1ccccc1CNC(=S)Nc1ccc2[nH]cnc2c1
: