Target
Tumor necrosis factor
Ligand
BDBM309960
Substrate
Meas. Tech.
Enzymatic Inhibitory Assay
IC50
66.0±n/a nM
Citation
 Xu, ZLou, Y Fused heterocyclic compound, preparation method therefor, pharmaceutical composition, and uses thereof US Patent  US9656996 Publication Date 5/23/2017 
Target
Name:
Tumor necrosis factor
Synonyms:
Cachectin TNF-a TNFA TNFSF2 Tumor necrosis factor (TNFa) Tumor necrosis factor ligand superfamily member 2 Tumor necrosis factor, soluble form | tumor necrosis factor alpha
Type:
Enzyme
Mol. Mass.:
25645.11
Organism:
Homo sapiens (Human)
Description:
P01375
Residue:
233
  
Inhibitor
Name:
BDBM309960
Synonyms:
US9656996, Compound 10
Type:
Small organic molecule
Emp. Form.:
C28H37FN6O5S
Mol. Mass.:
588.694
SMILES:
COc1ncc(cc1NS(C)(=O)=O)-c1nc(nc2c(CN3CCC(CC3)C(C)(C)O)cc(F)cc12)N1CCOCC1
: