Target
Tumor necrosis factor
Ligand
BDBM309962
Substrate
Meas. Tech.
Enzymatic Inhibitory Assay
IC50
15.2±n/a nM
Citation
 Xu, ZLou, Y Fused heterocyclic compound, preparation method therefor, pharmaceutical composition, and uses thereof US Patent  US9656996 Publication Date 5/23/2017 
Target
Name:
Tumor necrosis factor
Synonyms:
Cachectin TNF-a TNFA TNFSF2 Tumor necrosis factor (TNFa) Tumor necrosis factor ligand superfamily member 2 Tumor necrosis factor, soluble form | tumor necrosis factor alpha
Type:
Enzyme
Mol. Mass.:
25645.11
Organism:
Homo sapiens (Human)
Description:
P01375
Residue:
233
  
Inhibitor
Name:
BDBM309962
Synonyms:
US9656996, Compound 18
Type:
Small organic molecule
Emp. Form.:
C25H34N8O6S
Mol. Mass.:
574.652
SMILES:
COc1ncc(cc1NS(C)(=O)=O)-c1nc(N2CCOCC2)c2nc(OC3CCN(CC3)C3COC3)n(C)c2n1
: