Target
Tumor necrosis factor
Ligand
BDBM309966
Substrate
Meas. Tech.
Enzymatic Inhibitory Assay
IC50
260±n/a nM
Citation
 Xu, ZLou, Y Fused heterocyclic compound, preparation method therefor, pharmaceutical composition, and uses thereof US Patent  US9656996 Publication Date 5/23/2017 
Target
Name:
Tumor necrosis factor
Synonyms:
Cachectin TNF-a TNFA TNFSF2 Tumor necrosis factor (TNFa) Tumor necrosis factor ligand superfamily member 2 Tumor necrosis factor, soluble form | tumor necrosis factor alpha
Type:
Enzyme
Mol. Mass.:
25645.11
Organism:
Homo sapiens (Human)
Description:
P01375
Residue:
233
  
Inhibitor
Name:
BDBM309966
Synonyms:
US9656996, Compound 33
Type:
Small organic molecule
Emp. Form.:
C26H33FN6O5S
Mol. Mass.:
560.641
SMILES:
COc1ncc(cc1NS(C)(=O)=O)-c1nc(nc2c(OCCN3CCCCC3)cc(F)cc12)N1CCOCC1
: