Target
Androgen receptor
Ligand
BDBM309981
Substrate
Meas. Tech.
Binding Assay
Ki
13.0±n/a nM
Citation
 Wohlfahrt, GTörmäkangas, OSalo, HHöglund, IKarjalainen, AKoivikko, PHolm, PRasku, SVesalainen, A Androgen receptor modulating compounds US Patent  US9657003 Publication Date 5/23/2017 
Target
Name:
Androgen receptor
Synonyms:
ANDR_HUMAN Androgen Receptor Androgen receptor/Baculoviral IAP repeat-containing protein 2 Dihydrotestosterone receptor Nuclear receptor subfamily 3 group C member 4
Type:
Receptor
Mol. Mass.:
99185.27
Organism:
Homo sapiens (Human)
Description:
CHO cells were stably transfected with human AR gene.
Residue:
920
  
Inhibitor
Name:
BDBM309981
Synonyms:
(S)-N-(1-(3-(3-chloro-4-cyanophenyl)-1H-pyrazol-1-yl)propan-2-yl)-3-ethyl-1,2,4-oxadiazole-5-carboxamide | US9657003, 91
Type:
Small organic molecule
Emp. Form.:
C18H17ClN6O2
Mol. Mass.:
384.82
SMILES:
CCc1noc(n1)C(=O)N[C@@H](C)Cn1ccc(n1)-c1ccc(C#N)c(Cl)c1
: