Target
Phosphatidylinositol 4,5-bisphosphate 3-kinase catalytic subunit gamma isoform
Ligand
BDBM259446
Substrate
IC50
388±n/a nM
Citation
 Xi, NWang, LWang, T Substituted aminopyrimidine compounds and methods of use US Patent  US9657007 Publication Date 5/23/2017 
Target
Name:
Phosphatidylinositol 4,5-bisphosphate 3-kinase catalytic subunit gamma isoform
Synonyms:
PI3-kinase p110 subunit gamma PI3Kgamma PK3CG_HUMAN Phosphatidylinositol 4,5-bisphosphate 3-kinase (PI3K) Phosphatidylinositol 4,5-bisphosphate 3-kinase catalytic subunit gamma (PI3Kgamma) Phosphatidylinositol 4,5-bisphosphate 3-kinase catalytic subunit gamma isoform (PI3K) Phosphatidylinositol-4,5-bisphosphate 3-kinase catalytic subunit gamma isoform Phosphoinositide 3-kinases gamma (PI3K gamma) p120-PI3K
Type:
Enzyme Subunit
Mol. Mass.:
126470.30
Organism:
Homo sapiens (Human)
Description:
P48736
Residue:
1102
  
Inhibitor
Name:
BDBM259446
Synonyms:
US9512114, 5 | US9657007, Example 5
Type:
Small organic molecule
Emp. Form.:
C25H22ClN7O2
Mol. Mass.:
487.941
SMILES:
CC[C@H](Nc1ncnc(N)c1-c1nnc(C)o1)c1cc2cccc(Cl)c2c(=O)n1-c1ccccc1
: