Target
Interleukin-1 receptor-associated kinase 4
Ligand
BDBM283875
Substrate
Meas. Tech.
Inhibition Assay
IC50
7.20±n/a nM
Citation
 Bhide, RSDuncia, JVHynes, JNair, SKPitts, WJKumar, SRGardner, DSMurugesan, NPaidi, VRSantella, JBSistla, RWu, H Heteroaryl substituted pyridyl compounds useful as kinase modulators US Patent  US9657009 Publication Date 5/23/2017 
Target
Name:
Interleukin-1 receptor-associated kinase 4
Synonyms:
IRAK-4 IRAK4_HUMAN Interleukin-1 receptor-associated kinase 4 (IRAK4) | Renal carcinoma antigen NY-REN-64
Type:
Protein
Mol. Mass.:
51519.08
Organism:
Homo sapiens (Human)
Description:
Q9NWZ3
Residue:
460
  
Inhibitor
Name:
BDBM283875
Synonyms:
US10023562, Example 67 US9657009, 67
Type:
Small organic molecule
Emp. Form.:
C23H26ClN7O2
Mol. Mass.:
467.951
SMILES:
CC(=O)N[C@H]1CC[C@@H](CC1)NC(=O)c1cnc(Nc2ncc(cc2Cl)C#N)cc1NC1CC1
: