Target
Interleukin-1 receptor-associated kinase 4
Ligand
BDBM283878
Substrate
Meas. Tech.
Inhibition Assay
IC50
1.50±n/a nM
Citation
 Bhide, RSDuncia, JVHynes, JNair, SKPitts, WJKumar, SRGardner, DSMurugesan, NPaidi, VRSantella, JBSistla, RWu, H Heteroaryl substituted pyridyl compounds useful as kinase modulators US Patent  US9657009 Publication Date 5/23/2017 
Target
Name:
Interleukin-1 receptor-associated kinase 4
Synonyms:
IRAK-4 IRAK4_HUMAN Interleukin-1 receptor-associated kinase 4 (IRAK4) | Renal carcinoma antigen NY-REN-64
Type:
Protein
Mol. Mass.:
51519.08
Organism:
Homo sapiens (Human)
Description:
Q9NWZ3
Residue:
460
  
Inhibitor
Name:
BDBM283878
Synonyms:
US10023562, Example 70 US10023562, Example 73 US10544133, Example 74 | US9657009, 74
Type:
Small organic molecule
Emp. Form.:
C22H25ClF2N6O2
Mol. Mass.:
478.923
SMILES:
CC(C)(O)[C@H](F)CNC(=O)c1cnc(Nc2ncc(cc2Cl)C#N)cc1NC1CCCC1F
: