Target
Neutrophil elastase
Ligand
BDBM310019
Substrate
Meas. Tech.
Neutrophil Elastase Assay
IC50
2.40±n/a nM
Citation
 Gnamm, CAnderskewitz, RHoesch, HMorschhaeuser, GOost, TPeters, SRies, UJ Substituted bicyclic dihydropyrimidinones and their use as inhibitors of neutrophil elastase activity US Patent  US9657015 Publication Date 5/23/2017 
Target
Name:
Neutrophil elastase
Synonyms:
Bone marrow serine protease Coagulation factor X ELANE Elastase HLE Leukocyte elastase Medullasin Neutrophil elastase (HNE) PMN elastase Trypsin
Type:
Enzyme
Mol. Mass.:
28532.38
Organism:
Homo sapiens (Human)
Description:
P08246
Residue:
267
  
Inhibitor
Name:
BDBM310019
Synonyms:
US9657015, Example 12 US9657015, Example 12.2 US9657015, Example 12.4 US9657015, Example 12.6 US9657015, Example 12.8 | US9657015, Example 12.9
Type:
Small organic molecule
Emp. Form.:
C24H20F3N5O3
Mol. Mass.:
483.4425
SMILES:
CNC(=O)CN1C(C2=C(CCNC2=O)N(C1=O)c1cccc(c1)C(F)(F)F)c1ccc(cc1)C#N
: