Target
Proteinase-activated receptor 4
Ligand
BDBM176207
Substrate
Meas. Tech.
FLIPR Assay
Temperature
298.15±n/a K
EC50
6.90±n/a nM
Comments
extracted
Citation
 Banville, JRémillard, RRuediger, EHDeon, DHGagnon, MDubé, LGuy, JPriestley, ESPosy, SLMaxwell, BDWong, PCLawrence, RMMiller, MM Imidazothiadiazole and imidazopyrazine derivatives as protease activated receptor 4 (PAR4) inhibitors for treating platelet aggregation US Patent  US9688695 Publication Date 6/27/2017 
Target
Name:
Proteinase-activated receptor 4
Synonyms:
Coagulation factor II receptor-like 3 PAR-4 PAR4_HUMAN Proteinase-activated receptor 4 (PAR4) | Thrombin receptor-like 3
Type:
Protein
Mol. Mass.:
41145.16
Organism:
Homo sapiens (Human)
Description:
Q96RI0
Residue:
385
  
Inhibitor
Name:
BDBM176207
Synonyms:
US10047103, 240 | US9688695, 240
Type:
Small organic molecule
Emp. Form.:
C31H27ClN4O4S
Mol. Mass.:
587.088
SMILES:
COc1cc(OCc2csc(n2)C2(CCOCC2)c2cccc(Cl)c2)c2cc(oc2c1)-c1cn2nc(C)ccc2n1
: