Target
Nuclear receptor ROR-gamma
Ligand
BDBM310088
Substrate
Meas. Tech.
TR-FRET Assay Protocol I
EC50
2395±n/a nM
Citation
 Aicher, TDBarr, KJLapointe, BTSimov, VStein, KAThomas, WDToogood, PLVan Huis, CAWhite, CM Tetrahydronaphthyridine and related bicyclic compounds for inhibition of RORγ activity and the treatment of disease US Patent  US9657033 Publication Date 5/23/2017 
Target
Name:
Nuclear receptor ROR-gamma
Synonyms:
NR1F3 Nuclear receptor ROR-gamma (RORC) RAR-related orphan receptor C (RORc) RORG RZRG Retinoid-related orphan receptor-gamma (RORc)
Type:
Enzyme Catalytic Domain
Mol. Mass.:
58218.40
Organism:
Homo sapiens (Human)
Description:
P51449
Residue:
518
  
Inhibitor
Name:
BDBM310088
Synonyms:
2-chloro-6-fluoro-N-[1-(4-fluorobenzenesulfonyl)-1H-pyrazolo-[4,3-c]pyridin-6-yl]benzamide US9657033, Compound 2
Type:
Small organic molecule
Emp. Form.:
C19H11ClF2N4O3S
Mol. Mass.:
448.83
SMILES:
Fc1ccc(cc1)S(=O)(=O)n1ncc2cnc(NC(=O)c3c(F)cccc3Cl)cc12
: