Target
Nuclear receptor ROR-gamma
Ligand
BDBM310124
Substrate
Meas. Tech.
TR-FRET Assay Protocol II
EC50
61.0±n/a nM
Citation
 Aicher, TDBarr, KJLapointe, BTSimov, VStein, KAThomas, WDToogood, PLVan Huis, CAWhite, CM Tetrahydronaphthyridine and related bicyclic compounds for inhibition of RORγ activity and the treatment of disease US Patent  US9657033 Publication Date 5/23/2017 
Target
Name:
Nuclear receptor ROR-gamma
Synonyms:
NR1F3 Nuclear receptor ROR-gamma (RORC) RAR-related orphan receptor C (RORc) RORG RZRG Retinoid-related orphan receptor-gamma (RORc)
Type:
Enzyme Catalytic Domain
Mol. Mass.:
58218.40
Organism:
Homo sapiens (Human)
Description:
P51449
Residue:
518
  
Inhibitor
Name:
BDBM310124
Synonyms:
(S)-2-phenyl-N-(5-(m-tolylsulfonyl)-5,6,7,8-tetrahydro-1,5-naphthyridin-3-yl)propanamide US9657033, Compound 38
Type:
Small organic molecule
Emp. Form.:
C24H25N3O3S
Mol. Mass.:
435.539
SMILES:
C[C@H](C(=O)Nc1cnc2CCCN(c2c1)S(=O)(=O)c1cccc(C)c1)c1ccccc1
: