Target
Nuclear receptor ROR-gamma
Ligand
BDBM310153
Substrate
Meas. Tech.
TR-FRET Assay Protocol II
EC50
23.0±n/a nM
Citation
 Aicher, TDBarr, KJLapointe, BTSimov, VStein, KAThomas, WDToogood, PLVan Huis, CAWhite, CM Tetrahydronaphthyridine and related bicyclic compounds for inhibition of RORγ activity and the treatment of disease US Patent  US9657033 Publication Date 5/23/2017 
Target
Name:
Nuclear receptor ROR-gamma
Synonyms:
NR1F3 Nuclear receptor ROR-gamma (RORC) RAR-related orphan receptor C (RORc) RORG RZRG Retinoid-related orphan receptor-gamma (RORc)
Type:
Enzyme Catalytic Domain
Mol. Mass.:
58218.40
Organism:
Homo sapiens (Human)
Description:
P51449
Residue:
518
  
Inhibitor
Name:
BDBM310153
Synonyms:
US10377768, Compound 67 | US9657033, Compound 67
Type:
Small organic molecule
Emp. Form.:
C25H24Cl2N4O5S
Mol. Mass.:
563.453
SMILES:
C[C@H](O)C(=O)N[C@H]1CN(c2cc(NC(=O)c3c(Cl)cccc3Cl)cnc2C1)S(=O)(=O)c1cccc(C)c1
: