Target
Nuclear receptor ROR-gamma
Ligand
BDBM310157
Substrate
Meas. Tech.
TR-FRET Assay Protocol II
EC50
13.0±n/a nM
Citation
 Aicher, TDBarr, KJLapointe, BTSimov, VStein, KAThomas, WDToogood, PLVan Huis, CAWhite, CM Tetrahydronaphthyridine and related bicyclic compounds for inhibition of RORγ activity and the treatment of disease US Patent  US9657033 Publication Date 5/23/2017 
Target
Name:
Nuclear receptor ROR-gamma
Synonyms:
NR1F3 Nuclear receptor ROR-gamma (RORC) RAR-related orphan receptor C (RORc) RORG RZRG Retinoid-related orphan receptor-gamma (RORc)
Type:
Enzyme Catalytic Domain
Mol. Mass.:
58218.40
Organism:
Homo sapiens (Human)
Description:
P51449
Residue:
518
  
Inhibitor
Name:
BDBM310157
Synonyms:
N-[7-amino-5-(toluene-3-sulfonyl)-5,6,7,8-tetrahydro-9-oxa-1,5-diaza-benzocyclohepten-3-yl]-2,2,2-trifluoro-acetamide US9657033, Compound 71
Type:
Small organic molecule
Emp. Form.:
C17H17F3N4O4S
Mol. Mass.:
430.401
SMILES:
Cc1cccc(c1)S(=O)(=O)N1CC(N)COc2ncc(NC(=O)C(F)(F)F)cc12
: