Target
Protein arginine N-methyltransferase 5
Ligand
BDBM310196
Substrate
Meas. Tech.
PRMT5 Biochemical Assay
IC50
<100±n/a nM
Citation
 Duncan, KWChesworth, RMunchhof, MJ PRMT5 inhibitors and uses thereof US Patent  US10150758 Publication Date 12/11/2018 
Target
Name:
Protein arginine N-methyltransferase 5
Synonyms:
72 kDa ICln-binding protein HRMT1L5 IBP72 Jak-binding protein 1 PRMT5/MEP50 complex Protein arginine methyltransferase 5 (PRMT5) SKB1 homolog Shk1 kinase-binding protein 1 homolog
Type:
Enzyme
Mol. Mass.:
72679.99
Organism:
Homo sapiens (Human)
Description:
O14744
Residue:
637
  
Inhibitor
Name:
BDBM310196
Synonyms:
1-(3-(3,4-dihydroisoquinolin-2(1H)-yl)-2-hydroxypropyl)-4-(3-morpholinophenyl)piperazin-2-one | US10150758, Compound 12
Type:
Small organic molecule
Emp. Form.:
C26H34N4O3
Mol. Mass.:
450.5732
SMILES:
OC(CN1CCc2ccccc2C1)CN1CCN(CC1=O)c1cccc(c1)N1CCOCC1
: