Target
Acetylcholinesterase
Ligand
BDBM9009
Substrate
BDBM8959
Meas. Tech.
Cholinesterase Inhibition Assay
pH
8±n/a
Temperature
303.15±n/a K
IC50
0.2±0.01 nM
Citation
 Rodriguez-Franco, MIFernandez-Bachiller, MIPerez, CHernandez-Ledesma, BBartolome, B Novel tacrine-melatonin hybrids as dual-acting drugs for Alzheimer disease, with improved acetylcholinesterase inhibitory and antioxidant properties. J Med Chem 49:459-62 (2006)  
Target
Name:
Acetylcholinesterase
Synonyms:
ACES_BOVIN Acetylcholinesterase (AChE) | Acetylcholinesterase precursor
Type:
Enzyme
Mol. Mass.:
67659.62
Organism:
Bos taurus (bovine)
Description:
Residue:
613
  
Inhibitor
Name:
BDBM9009
Synonyms:
7-(6-Chloro-1,2,3,4-tetrahydro-acridin-9-ylamino)-heptanoic acid [2-(1H-indol-3-yl)-ethyl]-amide Tacrine-Melatonin Hybrid 4b
Type:
Small organic molecule
Emp. Form.:
C30H35ClN4O
Mol. Mass.:
503.078
SMILES:
Clc1ccc2c(NCCCCCCC(=O)NCCc3c[nH]c4ccccc34)c3CCCCc3nc2c1
:
Substrate
Name:
BDBM8959
Synonyms:
(2-Mercaptoethyl)trimethylammonium iodide acetate Acetylthiocholine acetylthiocholine chloride | acetylthiocholine iodide
Type:
Small organic molecule
Emp. Form.:
C7H16NOS
Mol. Mass.:
162.272
SMILES:
CC(=O)SCC[N+](C)(C)C
: