Target
Cholinesterase
Ligand
BDBM9012
Substrate
BDBM8978
Meas. Tech.
Cholinesterase Inhibition Assay
IC50
7.8±n/a nM
Citation
 Rodriguez-Franco, MIFernandez-Bachiller, MIPerez, CHernandez-Ledesma, BBartolome, B Novel tacrine-melatonin hybrids as dual-acting drugs for Alzheimer disease, with improved acetylcholinesterase inhibitory and antioxidant properties. J Med Chem 49:459-62 (2006)  
Target
Name:
Cholinesterase
Synonyms:
Acylcholine acylhydrolase Butyrylcholine esterase (BChE) Butyrylcholinesterase (BuChE) CHLE_HUMAN Cholinesterases Pseudocholinesterase
Type:
Homotetramer
Mol. Mass.:
68422.27
Organism:
Homo sapiens (Human)
Description:
P06276
Residue:
602
  
Inhibitor
Name:
BDBM9012
Synonyms:
7-(6,8-Dichloro-1,2,3,4-tetrahydro-acridin-9-ylamino)-heptanoic acid [2-(1H-indol-3-yl)-ethyl]-amide CHEMBL199585 | Tacrine-Melatonin Hybrid 6b
Type:
Small organic molecule
Emp. Form.:
C30H34Cl2N4O
Mol. Mass.:
537.523
SMILES:
Clc1cc(Cl)c2c(NCCCCCCC(=O)NCCc3c[nH]c4ccccc34)c3CCCCc3nc2c1
:
Substrate
Name:
BDBM8978
Synonyms:
(Propylcarbonylthioethyl)trimethylammonium iodide CHEMBL148530 butyrylthiocholine | butyrylthiocholine chloride
Type:
Small organic molecule
Emp. Form.:
C9H20NOS
Mol. Mass.:
190.326
SMILES:
CCCC(=O)SCC[N+](C)(C)C
: