Target
Apelin receptor
Ligand
BDBM310299
Substrate
Meas. Tech.
[35S]GTPgammaS Binding
EC50
15.0±n/a nM
Citation
 Chen, XCheng, ACConnors, RVDebenedetto, MVDransfield, PJFu, ZHarvey, JSHeath, JAHouze, JJudd, TCKopecky, DJLai, SMa, ZNishimura, NOlson, SHPattaropong, VWang, X Compounds for use in preparing heterocyclic triazole agonists of the APJ receptor US Patent  US10150760 Publication Date 12/11/2018 
Target
Name:
Apelin receptor
Synonyms:
AGTRL1 APJ_HUMAN Angiotensin receptor-like 1 Apelin receptor (APJ) G-protein coupled receptor HG11
Type:
Enzyme Catalytic Domain
Mol. Mass.:
42664.06
Organism:
Homo sapiens (Human)
Description:
P35414
Residue:
380
  
Inhibitor
Name:
BDBM310299
Synonyms:
US10150760, Example 95.0 | US10150760, Example 96.0
Type:
Small organic molecule
Emp. Form.:
C23H32N8O6S
Mol. Mass.:
548.615
SMILES:
COc1ncnc(OC)c1-n1c(NS(=O)(=O)[C@@H](C)[C@@H](OC(C)C)c2ncc(C)cn2)nnc1[C@H]1CCCO1
: