Target
Apelin receptor
Ligand
BDBM310310
Substrate
Meas. Tech.
[35S]GTPgammaS Binding
EC50
53.0±n/a nM
Citation
 Chen, XCheng, ACConnors, RVDebenedetto, MVDransfield, PJFu, ZHarvey, JSHeath, JAHouze, JJudd, TCKopecky, DJLai, SMa, ZNishimura, NOlson, SHPattaropong, VWang, X Compounds for use in preparing heterocyclic triazole agonists of the APJ receptor US Patent  US10150760 Publication Date 12/11/2018 
Target
Name:
Apelin receptor
Synonyms:
AGTRL1 APJ_HUMAN Angiotensin receptor-like 1 Apelin receptor (APJ) G-protein coupled receptor HG11
Type:
Enzyme Catalytic Domain
Mol. Mass.:
42664.06
Organism:
Homo sapiens (Human)
Description:
P35414
Residue:
380
  
Inhibitor
Name:
BDBM310310
Synonyms:
US10150760, Example 106.0 | US10150760, Example 107.0
Type:
Small organic molecule
Emp. Form.:
C24H32N6O5S
Mol. Mass.:
516.613
SMILES:
COc1cccc(OC)c1-n1c(NS(=O)(=O)[C@@H](C)[C@H](C)c2cnc(C)cn2)nnc1[C@H]1CCCCO1
: