Target
Diacylglycerol O-acyltransferase 1
Ligand
BDBM176370
Substrate
Meas. Tech.
FlashPlate™ Assay
pH
7.4±n/a
Temperature
298.15±n/a K
IC50
3310±n/a nM
Comments
extracted
Citation
 Bongartz, JAMeerpoel, LBoeckx, GMVan Lommen, GRBuyck, CFObrecht, DErmert, PLuther, A Piperidine/piperazine derivatives US Patent  US9688696 Publication Date 6/27/2017 
Target
Name:
Diacylglycerol O-acyltransferase 1
Synonyms:
ACAT-related gene product 1 Acyl coA-diacylglycerol acyl transferase 1 (DGAT1) DGAT1 Diacylglycerol Acyltransferase (DGAT1) Diacylglycerol O-acyltransferase 1 (DGAT1) | Diglyceride acyltransferase
Type:
Protein
Mol. Mass.:
55297.82
Organism:
Homo sapiens (Human)
Description:
O75907
Residue:
488
  
Inhibitor
Name:
BDBM176370
Synonyms:
US9688696, 86
Type:
Small organic molecule
Emp. Form.:
C25H29N7OS
Mol. Mass.:
475.609
SMILES:
CSc1ccc(NC(=O)N2CCN(CC2)c2ccc(cc2)-c2nc3cnn(C(C)C)c3[nH]2)cc1
: