Target
Diacylglycerol O-acyltransferase 1
Ligand
BDBM176376
Substrate
Meas. Tech.
FlashPlate™ Assay
pH
7.4±n/a
Temperature
298.15±n/a K
IC50
3390±n/a nM
Comments
extracted
Citation
 Bongartz, JAMeerpoel, LBoeckx, GMVan Lommen, GRBuyck, CFObrecht, DErmert, PLuther, A Piperidine/piperazine derivatives US Patent  US9688696 Publication Date 6/27/2017 
Target
Name:
Diacylglycerol O-acyltransferase 1
Synonyms:
ACAT-related gene product 1 Acyl coA-diacylglycerol acyl transferase 1 (DGAT1) DGAT1 Diacylglycerol Acyltransferase (DGAT1) Diacylglycerol O-acyltransferase 1 (DGAT1) | Diglyceride acyltransferase
Type:
Protein
Mol. Mass.:
55297.82
Organism:
Homo sapiens (Human)
Description:
O75907
Residue:
488
  
Inhibitor
Name:
BDBM176376
Synonyms:
US9688696, 92
Type:
Small organic molecule
Emp. Form.:
C25H27N7O3
Mol. Mass.:
473.527
SMILES:
CC(C)n1ncc2nc([nH]c12)-c1ccc(cc1)N1CCN(CC1)C(=O)Nc1ccc2OCOc2c1
: