Target
Diacylglycerol O-acyltransferase 1
Ligand
BDBM176382
Substrate
Meas. Tech.
FlashPlate™ Assay
pH
7.4±n/a
Temperature
298.15±n/a K
IC50
3720±n/a nM
Comments
extracted
Citation
 Bongartz, JAMeerpoel, LBoeckx, GMVan Lommen, GRBuyck, CFObrecht, DErmert, PLuther, A Piperidine/piperazine derivatives US Patent  US9688696 Publication Date 6/27/2017 
Target
Name:
Diacylglycerol O-acyltransferase 1
Synonyms:
ACAT-related gene product 1 Acyl coA-diacylglycerol acyl transferase 1 (DGAT1) DGAT1 Diacylglycerol Acyltransferase (DGAT1) Diacylglycerol O-acyltransferase 1 (DGAT1) | Diglyceride acyltransferase
Type:
Protein
Mol. Mass.:
55297.82
Organism:
Homo sapiens (Human)
Description:
O75907
Residue:
488
  
Inhibitor
Name:
BDBM176382
Synonyms:
US9688696, 98
Type:
Small organic molecule
Emp. Form.:
C20H20BrN5O2
Mol. Mass.:
442.309
SMILES:
Cc1nc(no1)-c1ccc(cc1)N1CCN(CC1)C(=O)Nc1ccccc1Br
: