Target
Nuclear receptor ROR-gamma
Ligand
BDBM310623
Substrate
Meas. Tech.
RORgammat (full-length human) Reporter Assay A
IC50
12.0±n/a nM
Citation
 Goldberg, SVenkatesan, HKinzel, OGege, CSteeneck, CKleymann, GHoffmann, T Trifluoromethyl alcohols as modulators of RORγt US Patent  US10150762 Publication Date 12/11/2018 
Target
Name:
Nuclear receptor ROR-gamma
Synonyms:
NR1F3 Nuclear receptor ROR-gamma (RORC) RAR-related orphan receptor C (RORc) RORG RZRG Retinoid-related orphan receptor-gamma (RORc)
Type:
Enzyme Catalytic Domain
Mol. Mass.:
58218.40
Organism:
Homo sapiens (Human)
Description:
P51449
Residue:
518
  
Inhibitor
Name:
BDBM310623
Synonyms:
US10150762, Example 2/8
Type:
Small organic molecule
Emp. Form.:
C23H23Cl2F6N3O4S
Mol. Mass.:
622.408
SMILES:
C[C@H]1CCCN1C(=O)c1nc(sc1-c1ccc(c(Cl)c1Cl)C(O)(C(F)(F)F)C(F)(F)F)C(=O)NCC(C)(C)O
: