Target
Nuclear receptor ROR-gamma
Ligand
BDBM310627
Substrate
Meas. Tech.
ThermoFluor Assay
Kd
18.0±n/a nM
Citation
 Goldberg, SVenkatesan, HKinzel, OGege, CSteeneck, CKleymann, GHoffmann, T Trifluoromethyl alcohols as modulators of RORγt US Patent  US10150762 Publication Date 12/11/2018 
Target
Name:
Nuclear receptor ROR-gamma
Synonyms:
NR1F3 Nuclear receptor ROR-gamma (RORC) RAR-related orphan receptor C (RORc) RORG RZRG Retinoid-related orphan receptor-gamma (RORc)
Type:
Enzyme Catalytic Domain
Mol. Mass.:
58218.40
Organism:
Homo sapiens (Human)
Description:
P51449
Residue:
518
  
Inhibitor
Name:
BDBM310627
Synonyms:
US10150762, Example 2/12
Type:
Small organic molecule
Emp. Form.:
C22H19Cl2F8N3O4S
Mol. Mass.:
644.362
SMILES:
CC(C)(O)CNC(=O)c1nc(C(=O)N2CCC(F)(F)C2)c(s1)-c1ccc(c(Cl)c1Cl)C(O)(C(F)(F)F)C(F)(F)F
: