Target
Nuclear receptor ROR-gamma
Ligand
BDBM310662
Substrate
Meas. Tech.
RORgammat (full-length human) Reporter Assay A
IC50
20.0±n/a nM
Citation
 Goldberg, SVenkatesan, HKinzel, OGege, CSteeneck, CKleymann, GHoffmann, T Trifluoromethyl alcohols as modulators of RORγt US Patent  US10150762 Publication Date 12/11/2018 
Target
Name:
Nuclear receptor ROR-gamma
Synonyms:
NR1F3 Nuclear receptor ROR-gamma (RORC) RAR-related orphan receptor C (RORc) RORG RZRG Retinoid-related orphan receptor-gamma (RORc)
Type:
Enzyme Catalytic Domain
Mol. Mass.:
58218.40
Organism:
Homo sapiens (Human)
Description:
P51449
Residue:
518
  
Inhibitor
Name:
BDBM310662
Synonyms:
(S)-5-(4-(1,1,1,3,3,3-Hexafluoro-2-hydroxypropan-2-yl)-2-(trifluoromethyl)phenyl)-N-(2-hydroxy-2-methylpropyl)-4-(2-methylpyrrolidine-1-carbonyl)thiazole-2-carboxamide | US10150762, Example 10/4
Type:
Small organic molecule
Emp. Form.:
C24H24F9N3O4S
Mol. Mass.:
621.516
SMILES:
C[C@H]1CCCN1C(=O)c1nc(sc1-c1ccc(cc1C(F)(F)F)C(O)(C(F)(F)F)C(F)(F)F)C(=O)NCC(C)(C)O
: