Target
Nuclear receptor ROR-gamma
Ligand
BDBM310682
Substrate
Meas. Tech.
RORgammat (full-length human) Reporter Assay B
IC50
7.90±n/a nM
Citation
 Goldberg, SVenkatesan, HKinzel, OGege, CSteeneck, CKleymann, GHoffmann, T Trifluoromethyl alcohols as modulators of RORγt US Patent  US10150762 Publication Date 12/11/2018 
Target
Name:
Nuclear receptor ROR-gamma
Synonyms:
NR1F3 Nuclear receptor ROR-gamma (RORC) RAR-related orphan receptor C (RORc) RORG RZRG Retinoid-related orphan receptor-gamma (RORc)
Type:
Enzyme Catalytic Domain
Mol. Mass.:
58218.40
Organism:
Homo sapiens (Human)
Description:
P51449
Residue:
518
  
Inhibitor
Name:
BDBM310682
Synonyms:
(S)-5-(2-Chloro-4-(1,1,1,3,3,3-hexafluoro-2-hydroxypropan-2-yl)phenyl)-N-(2-hydroxy-2-methylpropyl)-4-(2-methylpyrrolidine-1-carbonyl)thiazole-2-carboxamide | US10150762, Example 15/10
Type:
Small organic molecule
Emp. Form.:
C23H24ClF6N3O4S
Mol. Mass.:
587.963
SMILES:
C[C@H]1CCCN1C(=O)c1nc(sc1-c1ccc(cc1Cl)C(O)(C(F)(F)F)C(F)(F)F)C(=O)NCC(C)(C)O
: