Target
Acetylcholinesterase
Ligand
BDBM9050
Substrate
BDBM8959
Meas. Tech.
Enzyme Inhibition Assay
pH
7.4±n/a
Temperature
310.15±n/a K
IC50
0.9±0.3 nM
Citation
 Hu, MKWu, LJHsiao, GYen, MH Homodimeric tacrine congeners as acetylcholinesterase inhibitors. J Med Chem 45:2277-82 (2002)  
Target
Name:
Acetylcholinesterase
Synonyms:
ACES_RAT Acetylcholinesterase and butyrylcholinesterase (AChE and BChE) Acetylcholinesterase, AChE | Ache
Type:
Enzyme
Mol. Mass.:
68193.62
Organism:
Rattus norvegicus (rat)
Description:
P37136
Residue:
614
  
Inhibitor
Name:
BDBM9050
Synonyms:
6-fluoro-N-{6-[(6-fluoro-1,2,3,4-tetrahydroacridin-9-yl)amino]hexyl}-1,2,3,4-tetrahydroacridin-9-amine Homodimeric Tacrine Analog 3d
Type:
Small organic molecule
Emp. Form.:
C32H36F2N4
Mol. Mass.:
514.6518
SMILES:
Fc1ccc2c(NCCCCCCNc3c4CCCCc4nc4cc(F)ccc34)c3CCCCc3nc2c1
:
Substrate
Name:
BDBM8959
Synonyms:
(2-Mercaptoethyl)trimethylammonium iodide acetate Acetylthiocholine acetylthiocholine chloride | acetylthiocholine iodide
Type:
Small organic molecule
Emp. Form.:
C7H16NOS
Mol. Mass.:
162.272
SMILES:
CC(=O)SCC[N+](C)(C)C
: