Target
Histone deacetylase 1
Ligand
BDBM310716
Substrate
Meas. Tech.
HDAC inhibitory assay
IC50
5500±n/a nM
Citation
 Shuttleworth, SJTomassi, CDCecil, ARMacCormick, SNodes, WJSilva, FA Histone deacetylase inhibitors and their use in therapy US Patent  US10150763 Publication Date 12/11/2018 
Target
Name:
Histone deacetylase 1
Synonyms:
Cereblon/Histone deacetylase 1 HDAC1 Histone deacetylase 1 (HDAC1) RPD3L1
Type:
Enzyme
Mol. Mass.:
55090.27
Organism:
Homo sapiens (Human)
Description:
Q13547
Residue:
482
  
Inhibitor
Name:
BDBM310716
Synonyms:
N-Hydroxy-8-(pyridin-2-yl(1,2,4-thiadiazol-5-yl)amino)octanamide | US10150763, Example P
Type:
Small organic molecule
Emp. Form.:
C15H21N5O2S
Mol. Mass.:
335.425
SMILES:
ONC(=O)CCCCCCCN(c1ncns1)c1ccccn1
: