Target
Histone deacetylase 6
Ligand
BDBM310719
Substrate
Meas. Tech.
HDAC inhibitory assay
IC50
<500±n/a nM
Citation
 Shuttleworth, SJTomassi, CDCecil, ARMacCormick, SNodes, WJSilva, FA Histone deacetylase inhibitors and their use in therapy US Patent  US10150763 Publication Date 12/11/2018 
Target
Name:
Histone deacetylase 6
Synonyms:
Cereblon/Histone deacetylase 6 HDAC6 Histone deacetylase 6 (HDAC6) KIAA0901 | ORF Names:JM21
Type:
Chromatin regulator; hydrolase; repressor
Mol. Mass.:
131381.51
Organism:
Homo sapiens (Human)
Description:
Q9UBN7
Residue:
1215
  
Inhibitor
Name:
BDBM310719
Synonyms:
7-((5-Fluoropyridin-2-yl)(1-methyl-1H-benzo[d]imidazol-2-yl)amino)-N-hydroxyheptanamide | US10150763, Example S
Type:
Small organic molecule
Emp. Form.:
C20H24FN5O2
Mol. Mass.:
385.4353
SMILES:
Cn1c(nc2ccccc12)N(CCCCCCC(=O)NO)c1ccc(F)cn1
: