Target
Histone deacetylase 6
Ligand
BDBM310736
Substrate
Meas. Tech.
HDAC inhibitory assay
IC50
<500±n/a nM
Citation
 Shuttleworth, SJTomassi, CDCecil, ARMacCormick, SNodes, WJSilva, FA Histone deacetylase inhibitors and their use in therapy US Patent  US10150763 Publication Date 12/11/2018 
Target
Name:
Histone deacetylase 6
Synonyms:
Cereblon/Histone deacetylase 6 HDAC6 Histone deacetylase 6 (HDAC6) KIAA0901 | ORF Names:JM21
Type:
Chromatin regulator; hydrolase; repressor
Mol. Mass.:
131381.51
Organism:
Homo sapiens (Human)
Description:
Q9UBN7
Residue:
1215
  
Inhibitor
Name:
BDBM310736
Synonyms:
8-(Benzo[d]thiazol-2-yl(pyridin-2-yl)amino)-N-hydroxyoctanamide | US10150763, Example JJ
Type:
Small organic molecule
Emp. Form.:
C20H24N4O2S
Mol. Mass.:
384.495
SMILES:
ONC(=O)CCCCCCCN(c1nc2ccccc2s1)c1ccccn1
: