Target
Histone deacetylase 1
Ligand
BDBM310737
Substrate
Meas. Tech.
HDAC inhibitory assay
IC50
5500±n/a nM
Citation
 Shuttleworth, SJTomassi, CDCecil, ARMacCormick, SNodes, WJSilva, FA Histone deacetylase inhibitors and their use in therapy US Patent  US10150763 Publication Date 12/11/2018 
Target
Name:
Histone deacetylase 1
Synonyms:
Cereblon/Histone deacetylase 1 HDAC1 Histone deacetylase 1 (HDAC1) RPD3L1
Type:
Enzyme
Mol. Mass.:
55090.27
Organism:
Homo sapiens (Human)
Description:
Q13547
Residue:
482
  
Inhibitor
Name:
BDBM310737
Synonyms:
N-Hydroxy-7-(pyridin-2-yl(thiazol-2-yl)amino)heptanamide | US10150763, Example KK
Type:
Small organic molecule
Emp. Form.:
C15H20N4O2S
Mol. Mass.:
320.41
SMILES:
ONC(=O)CCCCCCN(c1nccs1)c1ccccn1
: