Target
Histone-lysine N-methyltransferase EZH2
Ligand
BDBM310792
Substrate
Meas. Tech.
Wild-Type PRC2 Enzyme Assay
IC50
17561±n/a nM
Citation
 Campbell, JE Substituted benzene compounds US Patent  US10150764 Publication Date 12/11/2018 
Target
Name:
Histone-lysine N-methyltransferase EZH2
Synonyms:
ENX-1 EZH2_HUMAN Histone-lysine N-methyltransferase EZH2 Lysine N-methyltransferase 6
Type:
Protein
Mol. Mass.:
85367.84
Organism:
Homo sapiens (Human)
Description:
Q15910
Residue:
746
  
Inhibitor
Name:
BDBM310792
Synonyms:
US10150764, Compound 78
Type:
Small organic molecule
Emp. Form.:
C31H42ClN5O3
Mol. Mass.:
568.15
SMILES:
CCN(C1CCN(CCc2cccc(OC)c2)CC1)c1cc(Cl)cc(C(=O)NCc2c(C)n(C)nc2OC)c1C
: