Target
Histone-lysine N-methyltransferase EZH2 [Y641F]
Ligand
BDBM310798
Substrate
Meas. Tech.
Wild-Type PRC2 Enzyme Assay
IC50
1216±n/a nM
Citation
 Campbell, JE Substituted benzene compounds US Patent  US10150764 Publication Date 12/11/2018 
Target
Name:
Histone-lysine N-methyltransferase EZH2 [Y641F]
Synonyms:
EZH2 EZH2_HUMAN KMT6
Type:
Mol. Mass.:
85351.84
Organism:
Homo sapiens (Human)
Description:
Q15910[Y641F]
Residue:
746
  
Inhibitor
Name:
BDBM310798
Synonyms:
US10150764, Compound 84
Type:
Small organic molecule
Emp. Form.:
C35H49ClN6O3
Mol. Mass.:
637.255
SMILES:
CCN([C@H]1CC[C@@H](CC1)N(C)Cc1cccc(OC)c1)c1cc(Cl)cc(C(=O)NCc2c(N3CCCCC3)n(C)[nH]c2=O)c1C
: