Target
Histone-lysine N-methyltransferase EZH2
Ligand
BDBM310803
Substrate
Meas. Tech.
Wild-Type PRC2 Enzyme Assay
IC50
>50000±n/a nM
Citation
 Campbell, JE Substituted benzene compounds US Patent  US10150764 Publication Date 12/11/2018 
Target
Name:
Histone-lysine N-methyltransferase EZH2
Synonyms:
ENX-1 EZH2_HUMAN Histone-lysine N-methyltransferase EZH2 Lysine N-methyltransferase 6
Type:
Protein
Mol. Mass.:
85367.84
Organism:
Homo sapiens (Human)
Description:
Q15910
Residue:
746
  
Inhibitor
Name:
BDBM310803
Synonyms:
US10150764, Compound 89
Type:
Small organic molecule
Emp. Form.:
C24H33ClF3N5O2
Mol. Mass.:
515.999
SMILES:
CCN([C@H]1CC[C@@H](CC1)N(C)C)c1cc(Cl)cc(C(=O)NCc2c([nH]n(C)c2=O)C(F)(F)F)c1C
: