Target
Sodium/glucose cotransporter 2
Ligand
BDBM176463
Substrate
Meas. Tech.
In Vitro Human SGLT2 Inhibition Assay
pH
7.3±n/a
IC50
<10.00±n/a nM
Comments
extracted
Citation
 Carson, KGGoodwin, NCHarrison, BARawlins, DBStrobel, EZambrowicz, B Inhibitors of sodium glucose cotransporter 1 US Patent  US9688710 Publication Date 6/27/2017 
Target
Name:
Sodium/glucose cotransporter 2
Synonyms:
Na(+)/glucose cotransporter 2 SGLT2 Sodium-Dependent Glucose Cotransporter 2 (SGLT2) Solute carrier family 5 member 2
Type:
Protein
Mol. Mass.:
72902.00
Organism:
Homo sapiens (Human)
Description:
P31639
Residue:
672
  
Inhibitor
Name:
BDBM176463
Synonyms:
US9688710, 62 4-(4-(2-chloro-5-((2S,3R,4R,5S,6R)-3,4,5-trihydroxy-6-(methylthio)tetrahydro-2H-pyran-2-yl)benzyl)phenoxy)-N,N-bis(2-hydroxyethyl)butanamide
Type:
Small organic molecule
Emp. Form.:
C27H36ClNO8S
Mol. Mass.:
570.095
SMILES:
CS[C@H]1O[C@H]([C@H](O)[C@@H](O)[C@@H]1O)c1ccc(Cl)c(Cc2ccc(OCCCC(=O)N(CCO)CCO)cc2)c1
: