Target
Sodium/glucose cotransporter 1
Ligand
BDBM176530
Substrate
Meas. Tech.
In Vitro Human SGLT1 Inhibition Assay
pH
7.3±n/a
IC50
<10.00±n/a nM
Comments
extracted
Citation
 Carson, KGGoodwin, NCHarrison, BARawlins, DBStrobel, EZambrowicz, B Inhibitors of sodium glucose cotransporter 1 US Patent  US9688710 Publication Date 6/27/2017 
Target
Name:
Sodium/glucose cotransporter 1
Synonyms:
High affinity sodium-glucose cotransporter Na(+)/glucose cotransporter 1 SGLT1 Sodium-dependent glucose cotransporter 1 (SGLT1) Sodium/glucose cotransporter 1 (SGLT1) | Solute carrier family 5 member 1
Type:
Protein
Mol. Mass.:
73503.78
Organism:
Homo sapiens (Human)
Description:
P13866
Residue:
664
  
Inhibitor
Name:
BDBM176530
Synonyms:
US9688710, 93 (2S,3R,4R,5S,6R)-2-(3-(4-(4-(bis(2,3-dihydroxypropyl)amino)butyl)benzyl)-4-methylphenyl)-6-(methylthio)tetrahydro-2H-pyran-3,4,5-triol
Type:
Small organic molecule
Emp. Form.:
C30H45NO8S
Mol. Mass.:
579.745
SMILES:
CS[C@H]1O[C@H]([C@H](O)[C@@H](O)[C@@H]1O)c1ccc(C)c(Cc2ccc(CCCCN(CC(O)CO)CC(O)CO)cc2)c1
: