Target
P2X purinoceptor 7
Ligand
BDBM310838
Substrate
Meas. Tech.
Radioligand Binding
IC50
>10000±n/a nM
Citation
 Letavic, MARech, JCWall, JL P2X7 modulators US Patent  US10150766 Publication Date 12/11/2018 
Target
Name:
P2X purinoceptor 7
Synonyms:
ATP receptor P2X purinoceptor 7 P2X purinoceptor 7 (P2X7) P2X7 rat P2rx7 | Purinergic receptor
Type:
Protein
Mol. Mass.:
68403.50
Organism:
Rattus norvegicus (Rat)
Description:
Q64663
Residue:
595
  
Inhibitor
Name:
BDBM310838
Synonyms:
US10150766, Example 30
Type:
Small organic molecule
Emp. Form.:
C23H21ClF3N5O
Mol. Mass.:
475.894
SMILES:
Cc1nc2[C@H]3CCC[C@@H](Cc2c(n1)-c1cnn(C)c1)N3C(=O)c1cccc(c1Cl)C(F)(F)F
: