Target
P2X purinoceptor 7
Ligand
BDBM310849
Substrate
Meas. Tech.
Radioligand Binding
Ki
126±n/a nM
Citation
 Letavic, MARech, JCWall, JL P2X7 modulators US Patent  US10150766 Publication Date 12/11/2018 
Target
Name:
P2X purinoceptor 7
Synonyms:
ATP receptor P2RX7_HUMAN P2X purinoceptor 7 (P2X7) P2Z receptor | Purinergic receptor
Type:
Protein
Mol. Mass.:
68602.85
Organism:
Homo sapiens (Human)
Description:
Q99572
Residue:
595
  
Inhibitor
Name:
BDBM310849
Synonyms:
US10150766, Example 43
Type:
Small organic molecule
Emp. Form.:
C24H22F3N5O
Mol. Mass.:
453.4596
SMILES:
Cc1nc2[C@H]3CCC[C@@H](Cc2c(n1)-c1ncccn1)N3C(=O)c1cccc(c1C)C(F)(F)F
: