Target
P2X purinoceptor 7
Ligand
BDBM310859
Substrate
Meas. Tech.
Radioligand Binding
IC50
191±n/a nM
Citation
 Letavic, MARech, JCWall, JL P2X7 modulators US Patent  US10150766 Publication Date 12/11/2018 
Target
Name:
P2X purinoceptor 7
Synonyms:
ATP receptor P2X purinoceptor 7 P2X purinoceptor 7 (P2X7) P2X7 rat P2rx7 | Purinergic receptor
Type:
Protein
Mol. Mass.:
68403.50
Organism:
Rattus norvegicus (Rat)
Description:
Q64663
Residue:
595
  
Inhibitor
Name:
BDBM310859
Synonyms:
US10150766, Example 53
Type:
Small organic molecule
Emp. Form.:
C26H23F4N3O
Mol. Mass.:
469.4739
SMILES:
Cc1nc2[C@H]3CCC[C@@H](Cc2c(n1)-c1ccc(F)cc1)N3C(=O)c1cccc(c1C)C(F)(F)F
: