Target
P2X purinoceptor 7
Ligand
BDBM310861
Substrate
Meas. Tech.
Radioligand Binding
IC50
217±n/a nM
Citation
 Letavic, MARech, JCWall, JL P2X7 modulators US Patent  US10150766 Publication Date 12/11/2018 
Target
Name:
P2X purinoceptor 7
Synonyms:
ATP receptor P2X purinoceptor 7 P2X purinoceptor 7 (P2X7) P2X7 rat P2rx7 | Purinergic receptor
Type:
Protein
Mol. Mass.:
68403.50
Organism:
Rattus norvegicus (Rat)
Description:
Q64663
Residue:
595
  
Inhibitor
Name:
BDBM310861
Synonyms:
US10150766, Example 55
Type:
Small organic molecule
Emp. Form.:
C24H20Cl2FN3O
Mol. Mass.:
456.34
SMILES:
Cc1nc2[C@H]3CCC[C@@H](Cc2c(n1)-c1ccc(F)cc1)N3C(=O)c1cccc(Cl)c1Cl
: