Target
P2X purinoceptor 7
Ligand
BDBM310862
Substrate
Meas. Tech.
Radioligand Binding
Ki
100.0±n/a nM
Citation
 Letavic, MARech, JCWall, JL P2X7 modulators US Patent  US10150766 Publication Date 12/11/2018 
Target
Name:
P2X purinoceptor 7
Synonyms:
ATP receptor P2RX7_HUMAN P2X purinoceptor 7 (P2X7) P2Z receptor | Purinergic receptor
Type:
Protein
Mol. Mass.:
68602.85
Organism:
Homo sapiens (Human)
Description:
Q99572
Residue:
595
  
Inhibitor
Name:
BDBM310862
Synonyms:
US10150766, Example 56
Type:
Small organic molecule
Emp. Form.:
C23H21ClF3N5O
Mol. Mass.:
475.894
SMILES:
Cc1nc2[C@H]3CCC[C@@H](Cc2c(n1)-c1ccnn1C)N3C(=O)c1cccc(c1Cl)C(F)(F)F
: