Target
Histone-lysine N-methyltransferase EZH2
Ligand
BDBM172091
Substrate
Meas. Tech.
PRC2 Enzyme Assays
IC50
3.40±n/a nM
Citation
 Kuntz, KWChesworth, RDuncan, KWKeilhack, HWarholic, NKlaus, CKnutson, SKWigle, TJSeki, MShirotori, SKawano, S Aryl- or heteroaryl-substituted benzene compounds US Patent  US10155002 Publication Date 12/18/2018 
Target
Name:
Histone-lysine N-methyltransferase EZH2
Synonyms:
ENX-1 EZH2_HUMAN Histone-lysine N-methyltransferase EZH2 Lysine N-methyltransferase 6
Type:
Protein
Mol. Mass.:
85367.84
Organism:
Homo sapiens (Human)
Description:
Q15910
Residue:
746
  
Inhibitor
Name:
BDBM172091
Synonyms:
US10155002, Compound 97 US9090562, 97
Type:
Small organic molecule
Emp. Form.:
C35H46N4O3
Mol. Mass.:
570.7647
SMILES:
CCN(C1CCOCC1)c1cc(cc(C(=O)NCc2c(C)cc(C)[nH]c2=O)c1C)-c1ccc(CN(C)CC2CC2)cc1
: