Target
Isocitrate dehydrogenase [NADP], mitochondrial
Ligand
BDBM310935
Substrate
Meas. Tech.
IDH2 Inhibitory Activity
IC50
29.5±n/a nM
Citation
 Wang, SZhao, NLiu, XHu, YZhang, HLuo, HPeng, YXiao, DHan, YZhang, XTian, X Antitumor compound targeting IDH2 mutation and method of use thereof US Patent  US10155722 Publication Date 12/18/2018 
Target
Name:
Isocitrate dehydrogenase [NADP], mitochondrial
Synonyms:
IDH2 IDHP_HUMAN | Isocitrate dehydrogenase 2 (IDH2)
Type:
Protein
Mol. Mass.:
50923.31
Organism:
Homo sapiens (Human)
Description:
Full-length wild-type
Residue:
452
  
Inhibitor
Name:
BDBM310935
Synonyms:
US10155722, Example 5
Type:
Small organic molecule
Emp. Form.:
C23H18F5N3O3S
Mol. Mass.:
511.464
SMILES:
FC(F)(F)c1cccc(NC(=O)Nc2cc(ccc2-c2ccsc2)C(F)(F)C(=O)NC2COC2)c1
: